Reaction Details
TargetPoly [ADP-ribose] polymerase tankyrase-1
LigandBDBM50238436
Substrate/Competitorn/a
Meas. Tech.ChEMBL_1663210 (CHEMBL4012891)
IC50 16±n/a nM
Citation Thomson, DWWagner, AJBantscheff, MBenson, REDittus, LDuempelfeld, BDrewes, GKrause, JMoore, JTMueller, KPoeckel, DRau, CSalzer, EShewchuk, LHopf, CEmery, JGMuelbaier, M Discovery of a Highly Selective Tankyrase Inhibitor Displaying Growth Inhibition Effects against a Diverse Range of Tumor Derived Cell Lines. J Med Chem60:5455-5471 (2017) 
 
Poly [ADP-ribose] polymerase tankyrase-1
Name:Poly [ADP-ribose] polymerase tankyrase-1
Type:Enzyme
Mol. Mass.:142058.03
Organism:Homo sapiens (Human)
Description:O95271
Residue:1327
BDBM50238436
NameBDBM50238436
Synonyms:CHEMBL4079594
TypeSmall organic molecule
Emp. Form.C24H20N10O2
Mol. Mass.480.4814
SMILESO=C(N1CCN(CC1)C(=O)c1ncccn1)c1ccc(Nc2nc3ccccc3n3nnnc23)cc1