Reaction Details
TargetProtein mono-ADP-ribosyltransferase PARP11
LigandBDBM50238425
Substrate/Competitorn/a
Meas. Tech.ChEMBL_1663206 (CHEMBL4012887)
IC50<5012±n/a nM
Citation Thomson, DWWagner, AJBantscheff, MBenson, REDittus, LDuempelfeld, BDrewes, GKrause, JMoore, JTMueller, KPoeckel, DRau, CSalzer, EShewchuk, LHopf, CEmery, JGMuelbaier, M Discovery of a Highly Selective Tankyrase Inhibitor Displaying Growth Inhibition Effects against a Diverse Range of Tumor Derived Cell Lines. J Med Chem60:5455-5471 (2017) 
 
Protein mono-ADP-ribosyltransferase PARP11
Name:Protein mono-ADP-ribosyltransferase PARP11
Type:PROTEIN
Mol. Mass.:39601.40
Organism:Homo sapiens
Description:ChEMBL_107591
Residue:338
BDBM50238425
NameBDBM50238425
Synonyms:CHEMBL4064332
TypeSmall organic molecule
Emp. Form.C17H16N6
Mol. Mass.304.3491
SMILESCC(C)c1ccc(Nc2nc3ccccc3n3nnnc23)cc1