Reaction Details
TargetProtein mono-ADP-ribosyltransferase PARP4
LigandBDBM50238428
Substrate/Competitorn/a
Meas. Tech.ChEMBL_1663205 (CHEMBL4012886)
IC50<5012±n/a nM
Citation Thomson, DWWagner, AJBantscheff, MBenson, REDittus, LDuempelfeld, BDrewes, GKrause, JMoore, JTMueller, KPoeckel, DRau, CSalzer, EShewchuk, LHopf, CEmery, JGMuelbaier, M Discovery of a Highly Selective Tankyrase Inhibitor Displaying Growth Inhibition Effects against a Diverse Range of Tumor Derived Cell Lines. J Med Chem60:5455-5471 (2017) 
 
Protein mono-ADP-ribosyltransferase PARP4
Name:Protein mono-ADP-ribosyltransferase PARP4
Type:n/a
Mol. Mass.:192563.23
Organism:Homo sapiens (Human)
Description:Q9UKK3
Residue:1724
BDBM50238428
NameBDBM50238428
Synonyms:CHEMBL4087876
TypeSmall organic molecule
Emp. Form.C19H17N7O2
Mol. Mass.375.384
SMILESO=C(N1CCOCC1)c1ccc(Nc2nc3ccccc3n3nnnc23)cc1