Reaction Details
TargetPotassium voltage-gated channel subfamily H member 2
LigandBDBM50238633
Substrate/Competitorn/a
Meas. Tech.ChEMBL_1663976 (CHEMBL4013657)
IC50 67±n/a nM
Citation Leven, MKnaab, TCHeld, JDuffy, SMeister, SFischli, CMeitzner, DLehmann, ULungerich, BKuna, KStahlke, PDelves, MJBuchholz, MWinzeler, EAAvery, VMMordmüller, BWittlin, SKurz, T 3-Hydroxy-N'-arylidenepropanehydrazonamides with Halo-Substituted Phenanthrene Scaffolds Cure P. berghei Infected Mice When Administered Perorally. J Med Chem60:6036-6044 (2017) 
 
Potassium voltage-gated channel subfamily H member 2
Name:Potassium voltage-gated channel subfamily H member 2
Type:Multi-pass membrane protein
Mol. Mass.:126672.65
Organism:Homo sapiens (Human)
Description:Q12809
Residue:1159
BDBM50238633
NameBDBM50238633
Synonyms:CHEMBL4081080
TypeSmall organic molecule
Emp. Form.C25H17F6N3O
Mol. Mass.489.4124
SMILESN\C(CC(O)c1cc2c(F)cc(F)cc2c2cc(ccc12)C(F)(F)F)=N/N=C/c1ccc(F)cc1