Reaction Details
TargetCytochrome P450 1A1
LigandBDBM50014323
Substrate/Competitorn/a
Meas. Tech.ChEMBL_1664939 (CHEMBL4014735)
IC50 10.0±n/a nM
Citation Mohd Siddique, MUMcCann, GJSonawane, VRHorley, NGatchie, LJoshi, PBharate, SBJayaprakash, VSinha, BNChaudhuri, B Quinazoline derivatives as selective CYP1B1 inhibitors. Eur J Med Chem130:320-327 (2017) 
 
Cytochrome P450 1A1
Name:Cytochrome P450 1A1
Type:Protein
Mol. Mass.:58177.23
Organism:Homo sapiens (Human)
Description:P04798
Residue:512
BDBM50014323
NameBDBM50014323
Synonyms:2-PHENYL-4H-BENZO[H]CHROMEN-4-ONE 7,8-Benzoflavone alpha-naphthoflavone
TypeSmall organic molecule
Emp. Form.C19H12O2
Mol. Mass.272.2974
SMILESO=c1cc(oc2c3ccccc3ccc12)-c1ccccc1