Reaction Details
TargetCasein kinase I isoform delta
LigandBDBM274452
Substrate/Competitorn/a
Meas. Tech.Kinase Assay
pH7.4±n/a
Temperature298.15±n/a K
IC50 0.170±n/a nM
Commentsextracted
Citation Velaparthi, UDarne, CPDodd, DSSampognaro, AJWittman, MDKumaravel, SMullick, DLiu, PRachamreddy, CR Substituted imidazoles as casein kinase 1 D/E inhibitors US Patent US9556179 Publication Date 1/31/2017
 
Casein kinase I isoform delta
Name:Casein kinase I isoform delta
Type:Enzyme
Mol. Mass.:47356.76
Organism:Homo sapiens (Human)
Description:P48730
Residue:415
BDBM274452
NameBDBM274452
Synonyms:N-(6-(1-(1-((1H-pyrazol-5- yl)methyl)piperidin-4-yl)-4-(4- fluorophenyl)-1H-imidazol-5- yl)imidazo[1,2-b]pyridazin-2-yl)-2- fluoroisonicotinamide | US9556179, Compound 21
TypeSmall organic molecule
Emp. Form.C32H30F2N10O
Mol. Mass.608.6438
SMILESCc1nn(C)cc1CN1CCC(CC1)n1cnc(c1-c1ccc2nc(NC(=O)c3ccnc(F)c3)cn2n1)-c1ccc(F)cc1