Reaction Details
TargetCasein kinase I isoform delta
LigandBDBM274578
Substrate/Competitorn/a
Meas. Tech.Kinase Assay
pH7.4±n/a
Temperature298.15±n/a K
IC50 0.034±n/a nM
Commentsextracted
Citation Velaparthi, UDarne, CPDodd, DSSampognaro, AJWittman, MDKumaravel, SMullick, DLiu, PRachamreddy, CR Substituted imidazoles as casein kinase 1 D/E inhibitors US Patent US9556179 Publication Date 1/31/2017
 
Casein kinase I isoform delta
Name:Casein kinase I isoform delta
Type:Enzyme
Mol. Mass.:47356.76
Organism:Homo sapiens (Human)
Description:P48730
Residue:415
BDBM274578
NameBDBM274578
Synonyms:2-fluoro-N-(6-(4-(4- fluorophenyl)-1-(1- (2-hydroxyethyl)azetidin- 3-yl)-1H-imidazol-5- yl)imidazo[1,2-b]pyridazin- 2-yl)isonicotinamide | US9556179, Compound 150
TypeSmall organic molecule
Emp. Form.C26H22F2N8O2
Mol. Mass.516.5021
SMILESOCCN1CC(C1)n1cnc(c1-c1ccc2nc(NC(=O)c3ccnc(F)c3)cn2n1)-c1ccc(F)cc1