Reaction Details
TargetCasein kinase I isoform epsilon
LigandBDBM274886
Substrate/Competitorn/a
Meas. Tech.Kinase Assay
pH7.4±n/a
Temperature298.15±n/a K
IC50 2.30±n/a nM
Commentsextracted
Citation Velaparthi, UDarne, CPDodd, DSSampognaro, AJWittman, MDKumaravel, SMullick, DLiu, PRachamreddy, CR Substituted imidazoles as casein kinase 1 D/E inhibitors US Patent US9556179 Publication Date 1/31/2017
 
Casein kinase I isoform epsilon
Name:Casein kinase I isoform epsilon
Type:Protein
Mol. Mass.:47340.25
Organism:Homo sapiens (Human)
Description:P49674
Residue:416
BDBM274886
NameBDBM274886
Synonyms:2-Fluoro-N-(6-(2-(4-fluorophenyl)-7-pivaloyl- 5,6,7,8-tetrahydroimidazo[1,2-a]pyrazin-3- yl)imidazo[1,2-b]pyridazin-2- yl)isonicotinamide | US9556179, Compound 464
TypeSmall organic molecule
Emp. Form.C29H26F2N8O2
Mol. Mass.556.5659
SMILESCC(C)(C)C(=O)N1CCn2c(C1)nc(c2-c1ccc2nc(NC(=O)c3ccnc(F)c3)cn2n1)-c1ccc(F)cc1