Reaction Details
Target5-hydroxytryptamine receptor 2A
LigandBDBM81446
Substrate/Competitorn/a
Ki 46.4±n/a nM
CommentsPDSP_796
Citation Nelson, DLLucaites, VLAudia, JENissen, JSWainscott, DB Species differences in the pharmacology of the 5-hydroxytryptamine2 receptor: structurally specific differentiation by ergolines and tryptamines. J Pharmacol Exp Ther265:1272-9 (1993) 5-hydroxytryptamine receptor 2A
Name:5-hydroxytryptamine receptor 2A
Type:G Protein-Coupled Receptor (GPCR)
Mol. Mass.:52852.05
Organism:Rattus norvegicus (rat)
Description:Rat cortex membranes 5-HT2A receptors.
Residue:471
BDBM81446
NameBDBM81446
Synonyms:CAS_60-79-7 NSC_104873
TypeSmall organic molecule
Emp. Form.C19H23N3O2
Mol. Mass.325.4048
SMILESCC(CO)NC(=O)C1CN(C)C2Cc3c[nH]c4cccc(C2=C1)c34