Reaction Details
Target5-hydroxytryptamine receptor 2A
LigandBDBM84930
Substrate/Competitorn/a
Ki 40±n/a nM
CommentsPDSP_1151
Citation Nelson, DLLucaites, VLAudia, JENissen, JSWainscott, DB Species differences in the pharmacology of the 5-hydroxytryptamine2 receptor: structurally specific differentiation by ergolines and tryptamines. J Pharmacol Exp Ther265:1272-9 (1993) 5-hydroxytryptamine receptor 2A
Name:5-hydroxytryptamine receptor 2A
Type:Enzyme Catalytic Domain
Mol. Mass.:52679.13
Organism:PIG
Description:5-HT2 0 0::P50129
Residue:470
BDBM84930
NameBDBM84930
Synonyms:CAS_60634-51-7 NSC_107989
TypeSmall organic molecule
Emp. Form.C23H32N2O3
Mol. Mass.384.5118
SMILESCC(O)C(C)OC(=O)C1CC2C(Cc3cn(C(C)C)c4cccc2c34)N(C)C1