Reaction Details
Target5-hydroxytryptamine receptor 2A
LigandBDBM10755
Substrate/Competitorn/a
Ki 7.77±n/a nM
CommentsPDSP_150
Citation Wainscott, DBLucaites, VLKursar, JDBaez, MNelson, DL Pharmacologic characterization of the human 5-hydroxytryptamine2B receptor: evidence for species differences. J Pharmacol Exp Ther276:720-7 (1996) 5-hydroxytryptamine receptor 2A
Name:5-hydroxytryptamine receptor 2A
Type:undefined
Mol. Mass.:52607.65
Organism:Homo sapiens (Human)
Description:P28223
Residue:471
BDBM10755
NameBDBM10755
Synonyms:14C-5-hydroxy tryptamine creatinine disulfate 5-HT 5-hydroxy tryptamine creatinine disulfate Serotonin | [3H]-5-HT
TypeSmall organic molecule
Emp. Form.C10H12N2O
Mol. Mass.176.2151
SMILESNCCc1c[nH]c2ccc(O)cc12