Reaction Details
Target5-hydroxytryptamine receptor 2A
LigandBDBM28582
Substrate/Competitorn/a
Ki 0.65±n/a nM
CommentsPDSP_719
Citation Wainscott, DBLucaites, VLKursar, JDBaez, MNelson, DL Pharmacologic characterization of the human 5-hydroxytryptamine2B receptor: evidence for species differences. J Pharmacol Exp Ther276:720-7 (1996) 5-hydroxytryptamine receptor 2A
Name:5-hydroxytryptamine receptor 2A
Type:undefined
Mol. Mass.:52607.65
Organism:Homo sapiens (Human)
Description:P28223
Residue:471
BDBM28582
NameBDBM28582
Synonyms:1-(4-iodo-2,5-dimethoxyphenyl)propan-2-amine DOI DOI,(-) [125I]4-iodo-2,5-dimethoxyphenylisopropylamine | [125I]DOI
Typeradiolabeled ligand
Emp. Form.C11H16INO2
Mol. Mass.321.1547
SMILESCOc1cc(CC(C)N)c(OC)cc1I