Reaction Details
Target5-hydroxytryptamine receptor 2A
LigandBDBM9019
Substrate/Competitorn/a
Ki>10000±n/a nM
CommentsPDSP_1189
Citation Wainscott, DBLucaites, VLKursar, JDBaez, MNelson, DL Pharmacologic characterization of the human 5-hydroxytryptamine2B receptor: evidence for species differences. J Pharmacol Exp Ther276:720-7 (1996) 5-hydroxytryptamine receptor 2A
Name:5-hydroxytryptamine receptor 2A
Type:undefined
Mol. Mass.:52607.65
Organism:Homo sapiens (Human)
Description:P28223
Residue:471
BDBM9019
NameBDBM9019
Synonyms:CHEMBL45 N-[2-(5-methoxy-1H-indol-3-yl)ethyl]acetamide
TypeSmall organic molecule
Emp. Form.C13H16N2O2
Mol. Mass.232.2783
SMILESCOc1ccc2[nH]cc(CCNC(C)=O)c2c1