Reaction Details
Target5-hydroxytryptamine receptor 2A
LigandBDBM50024205
Substrate/Competitorn/a
Ki 1.08±n/a nM
CommentsPDSP_1502
Citation Wainscott, DBLucaites, VLKursar, JDBaez, MNelson, DL Pharmacologic characterization of the human 5-hydroxytryptamine2B receptor: evidence for species differences. J Pharmacol Exp Ther276:720-7 (1996) 5-hydroxytryptamine receptor 2A
Name:5-hydroxytryptamine receptor 2A
Type:undefined
Mol. Mass.:52607.65
Organism:Homo sapiens (Human)
Description:P28223
Residue:471
BDBM50024205
NameBDBM50024205
Synonyms:3-{2-[4-(4-Fluoro-benzoyl)-piperidin-1-yl]-ethyl}-2-methyl-pyrido[1,2-a]pyrimidin-4-one CHEMBL18331 | PIRENPERONE
TypeSmall organic molecule
Emp. Form.C23H24FN3O2
Mol. Mass.393.454
SMILESCc1nc2ccccn2c(=O)c1CCN1CCC(CC1)C(=O)c1ccc(F)cc1