Reaction Details
Target5-hydroxytryptamine receptor 2B
LigandBDBM50331288
Substrate/Competitorn/a
Ki 13.9±n/a nM
CommentsPDSP_135
Citation Wainscott, DBLucaites, VLKursar, JDBaez, MNelson, DL Pharmacologic characterization of the human 5-hydroxytryptamine2B receptor: evidence for species differences. J Pharmacol Exp Ther276:720-7 (1996) 5-hydroxytryptamine receptor 2B
Name:5-hydroxytryptamine receptor 2B
Type:G Protein-Coupled Receptor (GPCR)
Mol. Mass.:54312.47
Organism:Homo sapiens (Human)
Description:Receptor binding assays were performed using human clone stably expressed in CHO cells.
Residue:481
BDBM50331288
NameBDBM50331288
Synonyms:2-(5-bromo-1H-indol-3-yl)ethanamine CHEMBL1288717
TypeSmall organic molecule
Emp. Form.C10H11BrN2
Mol. Mass.239.112
SMILESNCCc1c[nH]c2ccc(Br)cc12