Reaction Details
Target5-hydroxytryptamine receptor 2B
LigandBDBM84935
Substrate/Competitorn/a
Ki 12.3±n/a nM
CommentsPDSP_1152
Citation Wainscott, DBLucaites, VLKursar, JDBaez, MNelson, DL Pharmacologic characterization of the human 5-hydroxytryptamine2B receptor: evidence for species differences. J Pharmacol Exp Ther276:720-7 (1996) 5-hydroxytryptamine receptor 2B
Name:5-hydroxytryptamine receptor 2B
Type:G Protein-Coupled Receptor (GPCR)
Mol. Mass.:54312.47
Organism:Homo sapiens (Human)
Description:Receptor binding assays were performed using human clone stably expressed in CHO cells.
Residue:481
BDBM84935
NameBDBM84935
Synonyms:LY 86057 | LY86057
TypeSmall organic molecule
Emp. Form.C20H26N2O3
Mol. Mass.342.432
SMILESCC(O)C(C)OC(=O)C1CC2C(Cc3c[nH]c4cccc2c34)N(C)C1