Reaction Details
Target5-hydroxytryptamine receptor 2C
LigandBDBM82516
Substrate/Competitorn/a
Ki 6.27±n/a nM
CommentsPDSP_282
Citation Wainscott, DBLucaites, VLKursar, JDBaez, MNelson, DL Pharmacologic characterization of the human 5-hydroxytryptamine2B receptor: evidence for species differences. J Pharmacol Exp Ther276:720-7 (1996) 5-hydroxytryptamine receptor 2C
Name:5-hydroxytryptamine receptor 2C
Type:G Protein-Coupled Receptor (GPCR)
Mol. Mass.:51836.79
Organism:Homo sapiens (Human)
Description:P28335
Residue:458
BDBM82516
NameBDBM82516
Synonyms:AMESERGIDE NSC_60740
TypeSmall organic molecule
Emp. Form.C25H35N3O
Mol. Mass.393.5649
SMILESCC(C)n1cc2CC3C(CC(CN3C)C(=O)NC3CCCCC3)c3cccc1c23