Reaction Details
TargetMetabotropic glutamate receptor 1
LigandBDBM50004899
Substrate/Competitorn/a
Ki 3470±n/a nM
CommentsPDSP_2016
Citation Flor, PJGomeza, JTones, MAKuhn, RPin, JPKnöpfel, T The C-terminal domain of the mGluR1 metabotropic glutamate receptor affects sensitivity to agonists. J Neurochem67:58-63 (1996) 
 
Metabotropic glutamate receptor 1
Name:Metabotropic glutamate receptor 1
Type:Enzyme
Mol. Mass.:132358.19
Organism:Homo sapiens (Human)
Description:Q13255
Residue:1194
BDBM50004899
NameBDBM50004899
Synonyms:(1R,2S)-2-((S)-Amino-carboxy-methyl)-cyclopropanecarboxylic acid CHEMBL285369 L-CCG-IV
TypeSmall organic molecule
Emp. Form.C6H9NO4
Mol. Mass.159.14
SMILESN[C@@H]([C@H]1C[C@H]1C(O)=O)C(O)=O