Reaction Details
TargetGamma-aminobutyric acid receptor subunit alpha-6
LigandBDBM84956
Substrate/Competitorn/a
Ki 43.82±n/a nM
CommentsPDSP_503
Citation Yang, WDrewe, JALan, NC Cloning and characterization of the human GABAA receptor alpha 4 subunit: identification of a unique diazepam-insensitive binding site. Eur J Pharmacol291:319-25 (1995) 
 
Gamma-aminobutyric acid receptor subunit alpha-6
Name:Gamma-aminobutyric acid receptor subunit alpha-6
Type:Enzyme Catalytic Domain
Mol. Mass.:51029.60
Organism:Homo sapiens (Human)
Description:GABA A alpha6 0 HUMAN::Q16445
Residue:453
BDBM84956
NameBDBM84956
Synonyms:2-(4-Methoxy-phenyl)-2,5-dihydro-pyrazolo[4,3-c]quinolin-3-one (CGS 9895) CHEMBL296335
TypeSmall organic molecule
Emp. Form.C17H13N3O2
Mol. Mass.291.304
SMILESCOc1ccc(cc1)-n1[nH]c2c(cnc3ccccc23)c1=O