Reaction Details
TargetGamma-aminobutyric acid receptor subunit alpha-1
LigandBDBM50243981
Substrate/Competitorn/a
Ki 0.5±n/a nM
CommentsPDSP_351
Citation Scholze, PEbert, VSieghart, W Affinity of various ligands for GABAA receptors containing alpha 4 beta 3 gamma 2, alpha 4 gamma 2, or alpha 1 beta 3 gamma 2 subunits. Eur J Pharmacol304:155-62 (1996) 
 
Gamma-aminobutyric acid receptor subunit alpha-1
Name:Gamma-aminobutyric acid receptor subunit alpha-1
Type:Protein
Mol. Mass.:51817.35
Organism:Homo sapiens (Human)
Description:P14867
Residue:456
BDBM50243981
NameBDBM50243981
Synonyms:Beta CCM Methyl Beta-carboline-3 carboxylate | methyl 9H-pyrido[3,4-b]indole-3-carboxylate
TypeSmall organic molecule
Emp. Form.C13H10N2O2
Mol. Mass.226.2307
SMILESCOC(=O)c1cc2c(cn1)[nH]c1ccccc21