Reaction Details
Target5-hydroxytryptamine receptor 1D
LigandBDBM50060417
Substrate/Competitorn/a
Ki 1000±n/a nM
CommentsPDSP_1663
Citation Kennett, GAWood, MDBright, FCilia, JPiper, DCGager, TThomas, DBaxter, GSForbes, ITHam, PBlackburn, TP In vitro and in vivo profile of SB 206553, a potent 5-HT2C/5-HT2B receptor antagonist with anxiolytic-like properties. Br J Pharmacol117:427-434 (1996) 
 
5-hydroxytryptamine receptor 1D
Name:5-hydroxytryptamine receptor 1D
Type:Enzyme Catalytic Domain
Mol. Mass.:41780.38
Organism:GUINEA PIG
Description:5-HT1D HTR1D GUINEA PIG::Q60484
Residue:376
BDBM50060417
NameBDBM50060417
Synonyms:5-Methyl-3,5-dihydro-2H-pyrrolo[2,3-f]indole-1-carboxylic acid pyridin-3-ylamide SB 206553 | SB-206553
TypeSmall organic molecule
Emp. Form.C17H16N4O
Mol. Mass.292.3351
SMILESCn1ccc2cc3N(CCc3cc12)C(=O)Nc1cccnc1