Reaction Details
TargetSomatostatin receptor type 5
LigandBDBM85009
Substrate/Competitorn/a
Ki 0.42±n/a nM
CommentsPDSP_558
Citation Bass, RTBuckwalter, BLPatel, BPPausch, MHPrice, LAStrnad, JHadcock, JR Identification and characterization of novel somatostatin antagonists. Mol Pharmacol50:709-15 (1996) Somatostatin receptor type 5
Name:Somatostatin receptor type 5
Type:Enzyme Catalytic Domain
Mol. Mass.:39986.50
Organism:RAT
Description:SOMATOSTATIN SST5 SSTR5 RAT::P30938
Residue:363
BDBM85009
NameBDBM85009
Synonyms:H2N-4-NO2-Phe-c[Cys-Tyr-D-Trp-Lys-Val-Cys]-Tyr-Nh2
TypeSmall organic molecule
Emp. Form.C50H66N12O12S2
Mol. Mass.1091.262
SMILESCC(C)[C@H]1NC(=O)[C@H](CCCCN)NC(=O)[C@@H](Cc2c[nH]c3ccccc23)NC(=O)[C@H](Cc2ccc(O)cc2)NC(=O)[C@H](CSSC[C@@H](NC1=O)C(=O)N[C@H]([C@H](C)O)C(N)=O)NC(=O)[C@@H](N)Cc1ccc(cc1)[N+]([O-])=O