Reaction Details
TargetMetabotropic glutamate receptor 4
LigandBDBM50004863
Substrate/Competitorn/a
Ki>10000±n/a nM
CommentsPDSP_96
Citation Gomeza, JMary, SBrabet, IParmentier, MLRestituito, SBockaert, JPin, JP Coupling of metabotropic glutamate receptors 2 and 4 to G alpha 15, G alpha 16, and chimeric G alpha q/i proteins: characterization of new antagonists. Mol Pharmacol50:923-30 (1996) Metabotropic glutamate receptor 4
Name:Metabotropic glutamate receptor 4
Type:Enzyme
Mol. Mass.:101849.79
Organism:Rattus norvegicus (Rat)
Description:P31423
Residue:912
BDBM50004863
NameBDBM50004863
Synonyms:(+/-)-trans-ACPD (1S,3S)-1-aminocyclopentane-1,3-dicarboxylic acid 1-Amino-cyclopentane-1,3-dicarboxylic acid(cis-(1S,3S)-ACPD) 1R,3S-ACPD CHEMBL29726
TypeSmall organic molecule
Emp. Form.C7H11NO4
Mol. Mass.173.1665
SMILESN[C@]1(CC[C@@H](C1)C(O)=O)C(O)=O