Reaction Details
TargetVoltage-dependent L-type calcium channel subunit alpha-1C
LigandBDBM81790
Substrate/Competitorn/a
Ki>10000±n/a nM
CommentsPDSP_287
Citation Schoemaker, HClaustre, YFage, DRouquier, LChergui, KCuret, OOblin, AGonon, FCarter, CBenavides, JScatton, B Neurochemical characteristics of amisulpride, an atypical dopamine D2/D3 receptor antagonist with both presynaptic and limbic selectivity. J Pharmacol Exp Ther280:83-97 (1997) Voltage-dependent L-type calcium channel subunit alpha-1C
Name:Voltage-dependent L-type calcium channel subunit alpha-1C
Type:Enzyme Catalytic Domain
Mol. Mass.:243492.26
Organism:RAT
Description:Calcium channel 0 RAT::P22002
Residue:2169
BDBM81790
NameBDBM81790
Synonyms:Amisulpride NSC_2159 US10259786, Amisulpride
TypeSmall organic molecule
Emp. Form.C17H27N3O4S
Mol. Mass.369.479
SMILESCCN1CCCC1CNC(=O)c1cc(c(N)cc1OC)S(=O)(=O)CC