Reaction Details
Target5-hydroxytryptamine receptor 1D
LigandBDBM85079
Substrate/Competitorn/a
Ki 1200±n/a nM
CommentsPDSP_2284
Citation Mos, JVan Hest, AVan Drimmelen, MHerremans, AHOlivier, B The putative 5-HT1A receptor antagonist DU125530 blocks the discriminative stimulus of the 5-HT1A receptor agonist flesinoxan in pigeons. Eur J Pharmacol325:145-53 (1997) 
 
5-hydroxytryptamine receptor 1D
Name:5-hydroxytryptamine receptor 1D
Type:Enzyme Catalytic Domain
Mol. Mass.:41807.41
Organism:pigeon
Description:5-HT1D HTR1D pigeon::A0A1V4JDN9
Residue:375
BDBM85079
NameBDBM85079
Synonyms:2-[4-[4-[(7-Chloro-2,3-dihydro-1,4-benzodioxin)-5-yl]-1-piperazinyl]butyl]-1,2-benzisothiazol-3(2H)-one 1,1-dioxide DU-125530 | DU125530
TypeSmall organic molecule
Emp. Form.C23H26ClN3O5S
Mol. Mass.491.988
SMILESClc1cc2OCCOc2c(c1)N1CCN(CCCCN2C(=O)c3ccccc3S2(=O)=O)CC1