Reaction Details
Target5-hydroxytryptamine receptor 2A
LigandBDBM50024210
Substrate/Competitorn/a
Ki 416.86±n/a nM
CommentsPDSP_1920
Citation Bonhaus, DWWeinhardt, KKTaylor, MDeSouza, AMcNeeley, PMSzczepanski, KFontana, DJTrinh, JRocha, CLDawson, MWFlippin, LAEglen, RM RS-102221: a novel high affinity and selective, 5-HT2C receptor antagonist. Neuropharmacology36:621-9 (1997) 
 
5-hydroxytryptamine receptor 2A
Name:5-hydroxytryptamine receptor 2A
Type:G Protein-Coupled Receptor (GPCR)
Mol. Mass.:52852.05
Organism:Rattus norvegicus (rat)
Description:Rat cortex membranes 5-HT2A receptors.
Residue:471
BDBM50024210
NameBDBM50024210
Synonyms:1H-indole-3-ethanamine 2-(3-indolyl)ethylamine tryptamine
TypeSmall organic molecule
Emp. Form.C10H12N2
Mol. Mass.160.2157
SMILESNCCc1c[nH]c2ccccc12