Reaction Details
TargetD(4) dopamine receptor
LigandBDBM85136
Substrate/Competitorn/a
Ki 2.5±n/a nM
CommentsPDSP_1309
Citation Tallman, JFPrimus, RJBrodbeck, RCornfield, LMeade, RWoodruff, KRoss, PThurkauf, AGallager, DW I. NGD 94-1: identification of a novel, high-affinity antagonist at the human dopamine D4 receptor. J Pharmacol Exp Ther282:1011-9 (1997) D(4) dopamine receptor
Name:D(4) dopamine receptor
Type:Enzyme
Mol. Mass.:48373.19
Organism:Homo sapiens (Human)
Description:P21917
Residue:419
BDBM85136
NameBDBM85136
Synonyms:CAS_188942 NGD 94-1 | NSC_188942
TypeSmall organic molecule
Emp. Form.C18H20N6
Mol. Mass.320.3916
SMILESC(N1CCN(CC1)c1ncccn1)c1cnc([nH]1)-c1ccccc1