Reaction Details
TargetD(4) dopamine receptor
LigandBDBM78576
Substrate/Competitorn/a
Ki 410±n/a nM
CommentsPDSP_1850
Citation Tallman, JFPrimus, RJBrodbeck, RCornfield, LMeade, RWoodruff, KRoss, PThurkauf, AGallager, DW I. NGD 94-1: identification of a novel, high-affinity antagonist at the human dopamine D4 receptor. J Pharmacol Exp Ther282:1011-9 (1997) D(4) dopamine receptor
Name:D(4) dopamine receptor
Type:Enzyme
Mol. Mass.:48373.19
Organism:Homo sapiens (Human)
Description:P21917
Residue:419
BDBM78576
NameBDBM78576
Synonyms:CIS-THIOTHIXENE SMR000058396 cid_941651 | med.21724, Compound Thiothixene
TypeSmall organic molecule
Emp. Form.C23H29N3O2S2
Mol. Mass.443.625
SMILESCN(C)S(=O)(=O)c1ccc2Sc3ccccc3\C(=C\CCN3CCN(C)CC3)c2c1