Reaction Details
TargetProstaglandin E2 receptor EP1 subtype
LigandBDBM85189
Substrate/Competitorn/a
Ki 600±n/a nM
CommentsPDSP_1460
Citation Kiriyama, MUshikubi, FKobayashi, THirata, MSugimoto, YNarumiya, S Ligand binding specificities of the eight types and subtypes of the mouse prostanoid receptors expressed in Chinese hamster ovary cells. Br J Pharmacol122:217-24 (1997) 
 
Prostaglandin E2 receptor EP1 subtype
Name:Prostaglandin E2 receptor EP1 subtype
Type:G-protein coupled receptor
Mol. Mass.:43000.62
Organism:Mus musculus (Mouse)
Description:n/a
Residue:405
BDBM85189
NameBDBM85189
Synonyms:PGE1,11-DEOXY
TypeSmall organic molecule
Emp. Form.C20H34O4
Mol. Mass.338.4816
SMILESCCCCCC(O)C=CC1CCC(=O)C1CCCCCCC(O)=O