Reaction Details
TargetProstaglandin E2 receptor EP2 subtype
LigandBDBM50008780
Substrate/Competitorn/a
Ki 220±n/a nM
CommentsPDSP_949
Citation Kiriyama, MUshikubi, FKobayashi, THirata, MSugimoto, YNarumiya, S Ligand binding specificities of the eight types and subtypes of the mouse prostanoid receptors expressed in Chinese hamster ovary cells. Br J Pharmacol122:217-24 (1997) 
 
Prostaglandin E2 receptor EP2 subtype
Name:Prostaglandin E2 receptor EP2 subtype
Type:G-protein coupled receptor
Mol. Mass.:40495.26
Organism:Mus musculus (Mouse)
Description:n/a
Residue:362
BDBM50008780
NameBDBM50008780
Synonyms:7-{3-[3-Hydroxy-4-(4-iodo-phenoxy)-but-1-enyl]-7-oxa-bicyclo[2.2.1]hept-2-yl}-hept-5-enoic acid I-BOP
TypeSmall organic molecule
Emp. Form.C23H29IO5
Mol. Mass.512.3778
SMILESO[C@@H](COc1ccc(I)cc1)\C=C\[C@H]1C2CC[C@H](O2)[C@@H]1C\C=C/CCCC(O)=O