Reaction Details
TargetProstaglandin E2 receptor EP3 subtype
LigandBDBM85185
Substrate/Competitorn/a
Ki 1.9±n/a nM
CommentsPDSP_1463
Citation Kiriyama, MUshikubi, FKobayashi, THirata, MSugimoto, YNarumiya, S Ligand binding specificities of the eight types and subtypes of the mouse prostanoid receptors expressed in Chinese hamster ovary cells. Br J Pharmacol122:217-24 (1997) 
 
Prostaglandin E2 receptor EP3 subtype
Name:Prostaglandin E2 receptor EP3 subtype
Type:G-protein coupled receptor
Mol. Mass.:40092.50
Organism:Mus musculus (Mouse)
Description:n/a
Residue:365
BDBM85185
NameBDBM85185
Synonyms:PGE2,16,16-DIMETHYL
TypeSmall organic molecule
Emp. Form.C22H36O5
Mol. Mass.380.5182
SMILESCCCCC(C)(C)C(O)C=CC1C(O)CC(=O)C1CC=CCCCC(O)=O