Reaction Details
TargetProstacyclin receptor
LigandBDBM50109546
Substrate/Competitorn/a
Ki 110±n/a nM
CommentsPDSP_468
Citation Kiriyama, MUshikubi, FKobayashi, THirata, MSugimoto, YNarumiya, S Ligand binding specificities of the eight types and subtypes of the mouse prostanoid receptors expressed in Chinese hamster ovary cells. Br J Pharmacol122:217-24 (1997) 
 
Prostacyclin receptor
Name:Prostacyclin receptor
Type:Enzyme Catalytic Domain
Mol. Mass.:44475.65
Organism:MOUSE
Description:Prostaglandin I2 PTGIR MOUSE::P43252
Residue:415
BDBM50109546
NameBDBM50109546
Synonyms:5-[(3aS,4R,5R,6aS)-5-Hydroxy-4-((S)-3-hydroxy-oct-1-enyl)-hexahydro-pentalen-(2Z)-ylidene]-pentanoic acid CARBACYCLIN PGI2
TypeSmall organic molecule
Emp. Form.C21H34O4
Mol. Mass.350.4923
SMILESCCCCC[C@H](O)\C=C\[C@H]1[C@H](O)C[C@@H]2C\C(C[C@H]12)=C\CCCC(O)=O