Reaction Details
TargetProstacyclin receptor
LigandBDBM50101828
Substrate/Competitorn/a
Ki 33±n/a nM
CommentsPDSP_1459
Citation Kiriyama, MUshikubi, FKobayashi, THirata, MSugimoto, YNarumiya, S Ligand binding specificities of the eight types and subtypes of the mouse prostanoid receptors expressed in Chinese hamster ovary cells. Br J Pharmacol122:217-24 (1997) 
 
Prostacyclin receptor
Name:Prostacyclin receptor
Type:Enzyme Catalytic Domain
Mol. Mass.:44475.65
Organism:MOUSE
Description:Prostaglandin I2 PTGIR MOUSE::P43252
Residue:415
BDBM50101828
NameBDBM50101828
Synonyms:7-[(1R,2R,3R)-3-Hydroxy-2-((E)-(R)-3-hydroxy-oct-1-enyl)-5-oxo-cyclopentyl]-heptanoic acid PGE1 | US9180116, PGE1
TypeSmall organic molecule
Emp. Form.C20H34O5
Mol. Mass.354.481
SMILESCCCCC[C@@H](O)\C=C\[C@H]1[C@H](O)CC(=O)[C@@H]1CCCCCCC(O)=O