Reaction Details
TargetProstaglandin F2-alpha receptor
LigandBDBM85177
Substrate/Competitorn/a
Ki 124±n/a nM
CommentsPDSP_1159
Citation Kiriyama, MUshikubi, FKobayashi, THirata, MSugimoto, YNarumiya, S Ligand binding specificities of the eight types and subtypes of the mouse prostanoid receptors expressed in Chinese hamster ovary cells. Br J Pharmacol122:217-24 (1997) 
 
Prostaglandin F2-alpha receptor
Name:Prostaglandin F2-alpha receptor
Type:Enzyme Catalytic Domain
Mol. Mass.:40714.02
Organism:MOUSE
Description:ProstaglandinF2Alpha PTGFR MOUSE::P43117
Residue:366
BDBM85177
NameBDBM85177
Synonyms:CAS_80558-61-8 NSC_119139
TypeSmall organic molecule
Emp. Form.C22H30O5
Mol. Mass.374.4706
SMILESOC(COc1ccccc1)C=CC1CCC(=O)C1CCCCCCC(O)=O