Reaction Details
TargetThromboxane-A synthase
LigandBDBM50008805
Substrate/Competitorn/a
Ki 0.68±n/a nM
CommentsPDSP_1654
Citation Kiriyama, MUshikubi, FKobayashi, THirata, MSugimoto, YNarumiya, S Ligand binding specificities of the eight types and subtypes of the mouse prostanoid receptors expressed in Chinese hamster ovary cells. Br J Pharmacol122:217-24 (1997) 
 
Thromboxane-A synthase
Name:Thromboxane-A synthase
Type:Enzyme Catalytic Domain
Mol. Mass.:60395.39
Organism:MOUSE
Description:Thromboxane Alpha 0 MOUSE::P36423
Residue:533
BDBM50008805
NameBDBM50008805
Synonyms:7-(3-Benzenesulfonylamino-bicyclo[2.2.1]hept-2-yl)-hept-5-enoic acid S 145 | S-145,(+)
TypeSmall organic molecule
Emp. Form.C20H27NO4S
Mol. Mass.377.498
SMILESOC(=O)CCC\C=C/C[C@H]1[C@@H]2CCC(C2)C1NS(=O)(=O)c1ccccc1