Reaction Details
TargetThromboxane-A synthase
LigandBDBM50008781
Substrate/Competitorn/a
Ki 13±n/a nM
CommentsPDSP_1747
Citation Kiriyama, MUshikubi, FKobayashi, THirata, MSugimoto, YNarumiya, S Ligand binding specificities of the eight types and subtypes of the mouse prostanoid receptors expressed in Chinese hamster ovary cells. Br J Pharmacol122:217-24 (1997) 
 
Thromboxane-A synthase
Name:Thromboxane-A synthase
Type:Enzyme Catalytic Domain
Mol. Mass.:60395.39
Organism:MOUSE
Description:Thromboxane Alpha 0 MOUSE::P36423
Residue:533
BDBM50008781
NameBDBM50008781
Synonyms:7-(3-(2-ethyl-N-phenylhydrazinecarboxamide)-7-oxa-bicyclo[2.2.1]hept-2-yl)-hept-5-enoic acid SQ 29548 | SQ-29548
TypeSmall organic molecule
Emp. Form.C21H29N3O4
Mol. Mass.387.4727
SMILESOC(=O)CCC\C=C/C[C@H]1[C@@H]2CCC(O2)[C@H]1CNNC(=O)Nc1ccccc1