Reaction Details
Target5-hydroxytryptamine receptor 4
LigandBDBM82087
Substrate/Competitorn/a
Ki 154.88±n/a nM
CommentsPDSP_172
Citation Claeysen, SFaye, PSebben, MLemaire, SBockaert, JDumuis, A Cloning and expression of human 5-HT4S receptors. Effect of receptor density on their coupling to adenylyl cyclase. Neuroreport8:3189-96 (1997) 
 
5-hydroxytryptamine receptor 4
Name:5-hydroxytryptamine receptor 4
Type:Enzyme
Mol. Mass.:43767.54
Organism:Homo sapiens (Human)
Description:Q13639
Residue:388
BDBM82087
NameBDBM82087
Synonyms:2-(5-methoxy-1H-indol-3-yl)ethanamine 5-Methoxytryptamine hydrochloride tryptamine, 5-Methoxy
TypeSmall organic molecule
Emp. Form.C11H14N2O
Mol. Mass.190.2417
SMILESCOc1ccc2[nH]cc(CCN)c2c1