Reaction Details
TargetGamma-aminobutyric acid receptor subunit alpha-1
LigandBDBM24183
Substrate/Competitorn/a
Ki 77.62±n/a nM
CommentsPDSP_867
Citation Ebert, BThompson, SASaounatsou, KMcKernan, RKrogsgaard-Larsen, PWafford, KA Differences in agonist/antagonist binding affinity and receptor transduction using recombinant human gamma-aminobutyric acid type A receptors. Mol Pharmacol52:1150-6 (1997) Gamma-aminobutyric acid receptor subunit alpha-1
Name:Gamma-aminobutyric acid receptor subunit alpha-1
Type:Protein
Mol. Mass.:51817.35
Organism:Homo sapiens (Human)
Description:P14867
Residue:456
BDBM24183
NameBDBM24183
Synonyms:4-amino-n-[2,3-3H]butyric acid Aminalon GABA [3H]GABA | cid_119
TypeRadiolabeled ligand
Emp. Form.C4H9NO2
Mol. Mass.103.1198
SMILESNCCCC(O)=O