Reaction Details
TargetNeuronal acetylcholine receptor subunit alpha-3
LigandBDBM50061565
Substrate/Competitorn/a
Ki 1400±n/a nM
CommentsPDSP_1187
Citation Stauderman, KAMahaffy, LSAkong, MVeliçelebi, GChavez-Noriega, LECrona, JHJohnson, ECElliott, KJGillespie, AReid, RTAdams, PHarpold, MMCorey-Naeve, J Characterization of human recombinant neuronal nicotinic acetylcholine receptor subunit combinations alpha2beta4, alpha3beta4 and alpha4beta4 stably expressed in HEK293 cells. J Pharmacol Exp Ther284:777-89 (1998) Neuronal acetylcholine receptor subunit alpha-3
Name:Neuronal acetylcholine receptor subunit alpha-3
Type:Enzyme Catalytic Domain
Mol. Mass.:57479.03
Organism:Homo sapiens (Human)
Description:Cholinergic, Nicotinic Alpha3Beta2 0 HUMAN::P32297
Residue:505
BDBM50061565
NameBDBM50061565
Synonyms:(+)Methyl-(2,3,3-trimethyl-bicyclo[2.2.1]hept-2-yl)-amine (-)Methyl-(2,3,3-trimethyl-bicyclo[2.2.1]hept-2-yl)-amine MECAMYLAMINE Methyl-(2,3,3-trimethyl-bicyclo[2.2.1]hept-2-yl)-amine(Mecamylamine)
TypeSmall organic molecule
Emp. Form.C11H21N
Mol. Mass.167.2911
SMILESCNC1(C)C2CCC(C2)C1(C)C