Reaction Details
TargetAdenosine receptor A3
LigandBDBM50106543
Substrate/Competitorn/a
Ki 0.64±n/a nM
CommentsPDSP_2881
Citation Klotz, KNHessling, JHegler, JOwman, CKull, BFredholm, BBLohse, MJ Comparative pharmacology of human adenosine receptor subtypes - characterization of stably transfected receptors in CHO cells. Naunyn Schmiedebergs Arch Pharmacol357:1-9 (1998) 
 
Adenosine receptor A3
Name:Adenosine receptor A3
Type:G Protein-Coupled Receptor (GPCR)
Mol. Mass.:36197.32
Organism:Homo sapiens (Human)
Description:P0DMS8
Residue:318
BDBM50106543
NameBDBM50106543
Synonyms:5-[6-(4-Amino-3-iodo-benzylamino)-purin-9-yl]-3,4-dihydroxy-tetrahydro-furan-2-carboxylic acid methylamide IAB-MECA
TypeSmall organic molecule
Emp. Form.C18H20IN7O4
Mol. Mass.525.3004
SMILESCNC(=O)[C@H]1O[C@H]([C@H](O)[C@@H]1O)n1cnc2c(NCc3ccc(N)c(I)c3)ncnc12