Reaction Details
TargetAlpha-2A adrenergic receptor
LigandBDBM81984
Substrate/Competitorn/a
Ki 20.42±n/a nM
CommentsPDSP_915
Citation Jasper, JRLesnick, JDChang, LKYamanishi, SSChang, TKHsu, SADaunt, DABonhaus, DWEglen, RM Ligand efficacy and potency at recombinant alpha2 adrenergic receptors: agonist-mediated [35S]GTPgammaS binding. Biochem Pharmacol55:1035-43 (1998) 
 
Alpha-2A adrenergic receptor
Name:Alpha-2A adrenergic receptor
Type:Enzyme Catalytic Domain
Mol. Mass.:48888.08
Organism:MOUSE
Description:adrenergic Alpha2A ADRA2A MOUSE::Q01338
Residue:450
BDBM81984
NameBDBM81984
Synonyms:CAS_29110-47-2 NSC_3519
TypeSmall organic molecule
Emp. Form.C9H9Cl2N3O
Mol. Mass.246.093
SMILESNC(=N)NC(=O)Cc1c(Cl)cccc1Cl