Reaction Details
TargetAlpha-2A adrenergic receptor
LigandBDBM25392
Substrate/Competitorn/a
Ki>10000±n/a nM
CommentsPDSP_6116
Citation Jasper, JRLesnick, JDChang, LKYamanishi, SSChang, TKHsu, SADaunt, DABonhaus, DWEglen, RM Ligand efficacy and potency at recombinant alpha2 adrenergic receptors: agonist-mediated [35S]GTPgammaS binding. Biochem Pharmacol55:1035-43 (1998) 
 
Alpha-2A adrenergic receptor
Name:Alpha-2A adrenergic receptor
Type:Enzyme Catalytic Domain
Mol. Mass.:48888.08
Organism:MOUSE
Description:adrenergic Alpha2A ADRA2A MOUSE::Q01338
Residue:450
BDBM25392
NameBDBM25392
Synonyms:4-[1-hydroxy-2-(isopropylamino)ethyl]pyrocatechol;hydrochloride 4-{1-hydroxy-2-[(propan-2-yl)amino]ethyl}benzene-1,2-diol, 2 ISOPROTERONOL Isoproterenol Isoproterenol,(+) Norisodrine | Novodrin
TypeSmall organic molecule
Emp. Form.C11H17NO3
Mol. Mass.211.2576
SMILESCC(C)NCC(O)c1ccc(O)c(O)c1