Reaction Details
TargetAlpha-2A adrenergic receptor
LigandBDBM31046
Substrate/Competitorn/a
Ki 20.42±n/a nM
CommentsPDSP_1479
Citation Jasper, JRLesnick, JDChang, LKYamanishi, SSChang, TKHsu, SADaunt, DABonhaus, DWEglen, RM Ligand efficacy and potency at recombinant alpha2 adrenergic receptors: agonist-mediated [35S]GTPgammaS binding. Biochem Pharmacol55:1035-43 (1998) 
 
Alpha-2A adrenergic receptor
Name:Alpha-2A adrenergic receptor
Type:Enzyme
Mol. Mass.:48979.91
Organism:Homo sapiens (Human)
Description:P08913
Residue:465
BDBM31046
NameBDBM31046
Synonyms:3-[4,5-dihydro-1H-imidazol-2-ylmethyl-(4-methylphenyl)amino]phenol;methanesulfonic acid 3-[N-(2-imidazolin-2-ylmethyl)-4-methyl-anilino]phenol;mesylic acid MLS000069487 PHENTOLAMINE MESYLATE cid_5775 | cid_91430
TypeSmall organic molecule
Emp. Form.C17H19N3O
Mol. Mass.281.3523
SMILESCc1ccc(cc1)N(CC1=NCCN1)c1cccc(O)c1