Reaction Details
TargetAlpha-2A adrenergic receptor
LigandBDBM30703
Substrate/Competitorn/a
Ki 23.99±n/a nM
CommentsPDSP_2767
Citation Jasper, JRLesnick, JDChang, LKYamanishi, SSChang, TKHsu, SADaunt, DABonhaus, DWEglen, RM Ligand efficacy and potency at recombinant alpha2 adrenergic receptors: agonist-mediated [35S]GTPgammaS binding. Biochem Pharmacol55:1035-43 (1998) 
 
Alpha-2A adrenergic receptor
Name:Alpha-2A adrenergic receptor
Type:Enzyme Catalytic Domain
Mol. Mass.:48888.08
Organism:MOUSE
Description:adrenergic Alpha2A ADRA2A MOUSE::Q01338
Residue:450
BDBM30703
NameBDBM30703
Synonyms:2-(4-tert-butyl-2,6-dimethyl-benzyl)-2-imidazoline;hydrochloride 2-[(4-tert-butyl-2,6-dimethylphenyl)methyl]-4,5-dihydro-1H-imidazole;hydrochloride MLS000069695 XYLOMETAZOLINE HYDROCHLORIDE cid_5282386
TypeSmall organic molecule
Emp. Form.C16H24N2
Mol. Mass.244.3752
SMILESCc1cc(cc(C)c1CC1=NCCN1)C(C)(C)C