Reaction Details
TargetAlpha-2B adrenergic receptor
LigandBDBM50027502
Substrate/Competitorn/a
Ki 2630.27±n/a nM
CommentsPDSP_2770
Citation Jasper, JRLesnick, JDChang, LKYamanishi, SSChang, TKHsu, SADaunt, DABonhaus, DWEglen, RM Ligand efficacy and potency at recombinant alpha2 adrenergic receptors: agonist-mediated [35S]GTPgammaS binding. Biochem Pharmacol55:1035-43 (1998) 
 
Alpha-2B adrenergic receptor
Name:Alpha-2B adrenergic receptor
Type:Enzyme
Mol. Mass.:49964.20
Organism:Homo sapiens (Human)
Description:P18089
Residue:450
BDBM50027502
NameBDBM50027502
Synonyms:4-(2-Amino-1-hydroxy-propyl)-benzene-1,2-diol Aldoclor-250 METHYLNORADRENALINE alpha-Methyl-(+/-)norepinephrine,(+/-) | alpha-Methyl-(-)norepinephrine,(+/-)
TypeSmall organic molecule
Emp. Form.C9H13NO3
Mol. Mass.183.2044
SMILESCC(N)C(O)c1ccc(O)c(O)c1