Reaction Details
TargetAlpha-2B adrenergic receptor
LigandBDBM50019848
Substrate/Competitorn/a
Ki 37.15±n/a nM
CommentsPDSP_959
Citation Jasper, JRLesnick, JDChang, LKYamanishi, SSChang, TKHsu, SADaunt, DABonhaus, DWEglen, RM Ligand efficacy and potency at recombinant alpha2 adrenergic receptors: agonist-mediated [35S]GTPgammaS binding. Biochem Pharmacol55:1035-43 (1998) 
 
Alpha-2B adrenergic receptor
Name:Alpha-2B adrenergic receptor
Type:Enzyme
Mol. Mass.:49964.20
Organism:Homo sapiens (Human)
Description:P18089
Residue:450
BDBM50019848
NameBDBM50019848
Synonyms:2-(2,3-dihydro-1,4-benzodioxin-2-yl)-4,5-dihydro-1H-imidazole CHEMBL10316 US8633208, Idazoxan
TypeSmall organic molecule
Emp. Form.C11H12N2O2
Mol. Mass.204.2252
SMILESC1CN=C(N1)C1COc2ccccc2O1