Reaction Details
TargetMelatonin receptor type 1A
LigandBDBM50043287
Substrate/Competitorn/a
Ki 0.12±n/a nM
CommentsPDSP_1190
Citation Sugden, DPickering, HTeh, MTGarratt, PJ Melatonin receptor pharmacology: toward subtype specificity. Biol Cell89:531-7 (1997) 
 
Melatonin receptor type 1A
Name:Melatonin receptor type 1A
Type:Enzyme
Mol. Mass.:39392.94
Organism:Homo sapiens (Human)
Description:P48039
Residue:350
BDBM50043287
NameBDBM50043287
Synonyms:CHEMBL33415 N-[2-(2-Bromo-5-methoxy-1H-indol-3-yl)-ethyl]-acetamide | N-[2-(2-Bromo-5-methoxy-1H-indol-3-yl)-ethyl]-acetamide(2-Bromomelatonin)
TypeSmall organic molecule
Emp. Form.C13H15BrN2O2
Mol. Mass.311.174
SMILESCOc1ccc2[nH]c(Br)c(CCNC(C)=O)c2c1