Reaction Details
TargetNorepinephrine transporter
LigandBDBM50029150
Substrate/Competitorn/a
Ki 2758±n/a nM
CommentsPDSP_976
Citation Béïque, JCLavoie, Nde Montigny, CDebonnel, G Affinities of venlafaxine and various reuptake inhibitors for the serotonin and norepinephrine transporters. Eur J Pharmacol349:129-32 (1998) 
 
Norepinephrine transporter
Name:Norepinephrine transporter
Synonyms:n/a
Type:Enzyme Catalytic Domain
Mol. Mass.:2082.45
Organism:RAT
Description:Norepinephrine transporter 0 RAT::Q9JIA2
Residue:19
MLLARMKPQVQPELGGADQ
BDBM50029150
NameBDBM50029150
TypeSmall organic molecule
Emp. Form.C15H20N2
Mol. Mass.228.3327
SMILESC(Cc1c[nH]c2ccccc12)C1CCNCC1