Reaction Details
Target5-hydroxytryptamine receptor 2C
LigandBDBM50009057
Substrate/Competitorn/a
Ki>10000±n/a nM
CommentsPDSP_1214
Citation Toll, LBerzetei-Gurske, IPPolgar, WEBrandt, SRAdapa, IDRodriguez, LSchwartz, RWHaggart, DO'Brien, AWhite, AKennedy, JMCraymer, KFarrington, LAuh, JS Standard binding and functional assays related to medications development division testing for potential cocaine and opiate narcotic treatment medications. NIDA Res Monogr178:440-66 (1998) 5-hydroxytryptamine receptor 2C
Name:5-hydroxytryptamine receptor 2C
Type:Enzyme
Mol. Mass.:51935.10
Organism:Rattus norvegicus (Rat)
Description:P08909
Residue:460
BDBM50009057
NameBDBM50009057
Synonyms:(R)Methyl-(1-methyl-2-phenyl-ethyl)-amine METHAMPHETAMINE (+) Methyl-(1-methyl-2-phenyl-ethyl)-amine | Methyl-(1-methyl-2-phenyl-ethyl)-amine(methamphetamine)
TypeSmall organic molecule
Emp. Form.C10H15N
Mol. Mass.149.2328
SMILESCNC(C)Cc1ccccc1