Reaction Details
TargetFibroblast growth factor receptor 1
LigandBDBM275769
Substrate/Competitorn/a
Meas. Tech.CPE reduction assay
EC50<30.0±n/a nM
Citation Hostetler, KYBeadle, JR Phosphonate compounds US Patent US10071110 Publication Date 9/11/2018
 
Fibroblast growth factor receptor 1
Name:Fibroblast growth factor receptor 1
Type:Receptor
Mol. Mass.:91861.70
Organism:Homo sapiens (Human)
Description:P11362
Residue:822
BDBM275769
NameBDBM275769
Synonyms:Hexadecyloxypropyl-cyclic cidofovir US10071110, Compound HDP-cCDV
TypeSmall organic molecule
Emp. Form.C27H50N3O6P
Mol. Mass.543.6762
1(=O)COC(Cn2ccc(N)nc2=O)CO1